Reaction Details
TargetDelta-type opioid receptor
LigandBDBM50258880
Substrate/Competitorn/a
Meas. Tech.ChEMBL_500680 (CHEMBL966896)
Ki 2854±n/a nM
Citation Ho, GDAnthes, JBercovici, ACaldwell, JPCheng, KCCui, XFawzi, AFernandez, XGreenlee, WJHey, JKorfmacher, WLu, SXMcLeod, RLNg, FTorhan, ASTan, ZTulshian, DVarty, GBXu, XZhang, H The discovery of tropane derivatives as nociceptin receptor ligands for the management of cough and anxiety. Bioorg Med Chem Lett19:2519-23 (2009) 
 
Delta-type opioid receptor
Name:Delta-type opioid receptor
Type:G Protein-Coupled Receptor (GPCR)
Mol. Mass.:40382.98
Organism:Homo sapiens (Human)
Description:Competition binding assays were carried out using membrane preparations from transfected HN9.10 cells that constitutively expressed the delta opioid receptor.
Residue:372
BDBM50258880
NameBDBM50258880
Synonyms:8-(dio-tolylmethyl)-3-phenyl-8-azabicyclo[3.2.1]octan-3-ol | CHEMBL513136
TypeSmall organic molecule
Emp. Form.C28H31NO
Mol. Mass.397.5518
SMILESCc1ccccc1C(N1C2CCC1CC(O)(C2)c1ccccc1)c1ccccc1C