Reaction Details
TargetMu-type opioid receptor
LigandBDBM50259190
Substrate/Competitorn/a
Meas. Tech.ChEMBL_500675 (CHEMBL966891)
Ki 627±n/a nM
Citation Ho, GDAnthes, JBercovici, ACaldwell, JPCheng, KCCui, XFawzi, AFernandez, XGreenlee, WJHey, JKorfmacher, WLu, SXMcLeod, RLNg, FTorhan, ASTan, ZTulshian, DVarty, GBXu, XZhang, H The discovery of tropane derivatives as nociceptin receptor ligands for the management of cough and anxiety. Bioorg Med Chem Lett19:2519-23 (2009) 
 
Mu-type opioid receptor
Name:Mu-type opioid receptor
Type:G Protein-Coupled Receptor (GPCR)
Mol. Mass.:44789.51
Organism:Homo sapiens (Human)
Description:P35372
Residue:400
BDBM50259190
NameBDBM50259190
Synonyms:(8-(bis(2-chlorophenyl)methyl)-3-phenyl-8-azabicyclo[3.2.1]octan-3-yl)methanol | CHEMBL468952
TypeSmall organic molecule
Emp. Form.C27H27Cl2NO
Mol. Mass.452.415
SMILESOCC1(CC2CCC(C1)N2C(c1ccccc1Cl)c1ccccc1Cl)c1ccccc1