Reaction Details
TargetNociceptin receptor
LigandBDBM50259191
Substrate/Competitorn/a
Meas. Tech.ChEMBL_500674 (CHEMBL966890)
Ki 3151±n/a nM
Citation Ho, GDAnthes, JBercovici, ACaldwell, JPCheng, KCCui, XFawzi, AFernandez, XGreenlee, WJHey, JKorfmacher, WLu, SXMcLeod, RLNg, FTorhan, ASTan, ZTulshian, DVarty, GBXu, XZhang, H The discovery of tropane derivatives as nociceptin receptor ligands for the management of cough and anxiety. Bioorg Med Chem Lett19:2519-23 (2009) 
 
Nociceptin receptor
Name:Nociceptin receptor
Type:G Protein-Coupled Receptor (GPCR)
Mol. Mass.:40702.87
Organism:Homo sapiens (Human)
Description:P41146
Residue:370
BDBM50259191
NameBDBM50259191
Synonyms:8-(bis(2-chlorophenyl)methyl)-3-(fluoromethyl)-3-phenyl-8-azabicyclo[3.2.1]octane | CHEMBL506803
TypeSmall organic molecule
Emp. Form.C27H26Cl2FN
Mol. Mass.454.406
SMILESFCC1(CC2CCC(C1)N2C(c1ccccc1Cl)c1ccccc1Cl)c1ccccc1