Reaction Details
TargetNociceptin receptor
LigandBDBM50259403
Substrate/Competitorn/a
Meas. Tech.ChEMBL_500674 (CHEMBL966890)
Ki 10±n/a nM
Citation Ho, GDAnthes, JBercovici, ACaldwell, JPCheng, KCCui, XFawzi, AFernandez, XGreenlee, WJHey, JKorfmacher, WLu, SXMcLeod, RLNg, FTorhan, ASTan, ZTulshian, DVarty, GBXu, XZhang, H The discovery of tropane derivatives as nociceptin receptor ligands for the management of cough and anxiety. Bioorg Med Chem Lett19:2519-23 (2009) 
 
Nociceptin receptor
Name:Nociceptin receptor
Type:G Protein-Coupled Receptor (GPCR)
Mol. Mass.:40702.87
Organism:Homo sapiens (Human)
Description:P41146
Residue:370
BDBM50259403
NameBDBM50259403
Synonyms:8-(bis(2-chlorophenyl)methyl)-N-isopropyl-3-phenyl-8-azabicyclo[3.2.1]octane-3-carboxamide | CHEMBL467699
TypeSmall organic molecule
Emp. Form.C30H32Cl2N2O
Mol. Mass.507.494
SMILESCC(C)NC(=O)C1(CC2CCC(C1)N2C(c1ccccc1Cl)c1ccccc1Cl)c1ccccc1