Reaction Details
TargetDual specificity calcium/calmodulin-dependent 3',5'-cyclic nucleotide phosphodiesterase 1A
LigandBDBM50259017
Substrate/Competitorn/a
Meas. Tech.ChEMBL_500708 (CHEMBL966924)
IC50 1430±n/a nM
Citation Deninno, MPAndrews, MBell, ASChen, YEller-Zarbo, CEshelby, NEtienne, JBMoore, DEPalmer, MJVisser, MSYu, LJZavadoski, WJMichael Gibbs, E The discovery of potent, selective, and orally bioavailable PDE9 inhibitors as potential hypoglycemic agents. Bioorg Med Chem Lett19:2537-41 (2009) 
 
Dual specificity calcium/calmodulin-dependent 3',5'-cyclic nucleotide phosphodiesterase 1A
Name:Dual specificity calcium/calmodulin-dependent 3',5'-cyclic nucleotide phosphodiesterase 1A
Type:Protein
Mol. Mass.:61245.69
Organism:Homo sapiens (Human)
Description:P54750
Residue:535
BDBM50259017
NameBDBM50259017
Synonyms:5-(2-(benzyloxy)benzyl)-3-isopropyl-1H-pyrazolo[4,3-d]pyrimidin-7(6H)-one | CHEMBL511564
TypeSmall organic molecule
Emp. Form.C22H22N4O2
Mol. Mass.374.4357
SMILESCC(C)c1[nH]nc2c1nc(Cc1ccccc1OCc1ccccc1)[nH]c2=O