Reaction Details
TargetHigh affinity cAMP-specific and IBMX-insensitive 3',5'-cyclic phosphodiesterase 8A
LigandBDBM50259148
Substrate/Competitorn/a
Meas. Tech.ChEMBL_500741 (CHEMBL970520)
IC50>1000±n/a nM
Citation Deninno, MPAndrews, MBell, ASChen, YEller-Zarbo, CEshelby, NEtienne, JBMoore, DEPalmer, MJVisser, MSYu, LJZavadoski, WJMichael Gibbs, E The discovery of potent, selective, and orally bioavailable PDE9 inhibitors as potential hypoglycemic agents. Bioorg Med Chem Lett19:2537-41 (2009) 
 
High affinity cAMP-specific and IBMX-insensitive 3',5'-cyclic phosphodiesterase 8A
Name:High affinity cAMP-specific and IBMX-insensitive 3',5'-cyclic phosphodiesterase 8A
Type:Enzyme Catalytic Domain
Mol. Mass.:93295.89
Organism:Homo sapiens (Human)
Description:Recombinant catalytic domain (M1-E829) of human PDE8A.
Residue:829
BDBM50259148
NameBDBM50259148
Synonyms:(-)2-({(trans)-2-[(3-isopropyl-7-oxo-6,7-dihydro-1H-pyrazolo[4,3-d]pyrimidin-5-yl)methyl]cyclohexyl}amino)-4-(trifluoromethyl)pyrimidine-5-carboxylic acid | CHEMBL466280
TypeSmall organic molecule
Emp. Form.C21H24F3N7O3
Mol. Mass.479.4556
SMILESCC(C)c1[nH]nc2c1nc(C[C@@H]1CCCC[C@H]1Nc1ncc(C(O)=O)c(n1)C(F)(F)F)[nH]c2=O