Reaction Details
TargetcGMP-inhibited 3',5'-cyclic phosphodiesterase 3B
LigandBDBM50259108
Substrate/Competitorn/a
Meas. Tech.ChEMBL_500733 (CHEMBL970512)
IC50>10000±n/a nM
Citation Deninno, MPAndrews, MBell, ASChen, YEller-Zarbo, CEshelby, NEtienne, JBMoore, DEPalmer, MJVisser, MSYu, LJZavadoski, WJMichael Gibbs, E The discovery of potent, selective, and orally bioavailable PDE9 inhibitors as potential hypoglycemic agents. Bioorg Med Chem Lett19:2537-41 (2009) 
 
cGMP-inhibited 3',5'-cyclic phosphodiesterase 3B
Name:cGMP-inhibited 3',5'-cyclic phosphodiesterase 3B
Type:Enzyme
Mol. Mass.:124318.95
Organism:Homo sapiens (Human)
Description:PDE3B was generated from the full-length recombinant human clone transfected into Sf9 cells.
Residue:1112
BDBM50259108
NameBDBM50259108
Synonyms:(-)3-Isopropyl-5-{[(trans)-2-(pyrimidin-2-ylamino)cyclohexyl]methyl}-1,6-dihydro-7H-pyrazolo[4,3-d]pyrimidin-7-one | CHEMBL466481
TypeSmall organic molecule
Emp. Form.C19H25N7O
Mol. Mass.367.4481
SMILESCC(C)c1[nH]nc2c1nc(C[C@@H]1CCCC[C@H]1Nc1ncccn1)[nH]c2=O