Reaction Details
TargetHigh affinity cAMP-specific and IBMX-insensitive 3',5'-cyclic phosphodiesterase 8B
LigandBDBM50259108
Substrate/Competitorn/a
Meas. Tech.ChEMBL_500742 (CHEMBL970521)
IC50>10000±n/a nM
Citation Deninno, MPAndrews, MBell, ASChen, YEller-Zarbo, CEshelby, NEtienne, JBMoore, DEPalmer, MJVisser, MSYu, LJZavadoski, WJMichael Gibbs, E The discovery of potent, selective, and orally bioavailable PDE9 inhibitors as potential hypoglycemic agents. Bioorg Med Chem Lett19:2537-41 (2009) 
 
High affinity cAMP-specific and IBMX-insensitive 3',5'-cyclic phosphodiesterase 8B
Name:High affinity cAMP-specific and IBMX-insensitive 3',5'-cyclic phosphodiesterase 8B
Type:PROTEIN
Mol. Mass.:98984.88
Organism:Homo sapiens (Human)
Description:ChEMBL_876321
Residue:885
BDBM50259108
NameBDBM50259108
Synonyms:(-)3-Isopropyl-5-{[(trans)-2-(pyrimidin-2-ylamino)cyclohexyl]methyl}-1,6-dihydro-7H-pyrazolo[4,3-d]pyrimidin-7-one | CHEMBL466481
TypeSmall organic molecule
Emp. Form.C19H25N7O
Mol. Mass.367.4481
SMILESCC(C)c1[nH]nc2c1nc(C[C@@H]1CCCC[C@H]1Nc1ncccn1)[nH]c2=O