Reaction Details
TargetAmine oxidase [flavin-containing] B
LigandBDBM50259619
Substrate/Competitorn/a
Meas. Tech.ChEMBL_500941 (CHEMBL972369)
Ki 310±n/a nM
Citation Van der Walt, EMMilczek, EMMalan, SFEdmondson, DECastagnoli, NBergh, JJPetzer, JP Inhibition of monoamine oxidase by (E)-styrylisatin analogues. Bioorg Med Chem Lett19:2509-13 (2009) 
 
Amine oxidase [flavin-containing] B
Name:Amine oxidase [flavin-containing] B
Type:Protein
Mol. Mass.:58768.76
Organism:Homo sapiens (Human)
Description:P27338
Residue:520
BDBM50259619
NameBDBM50259619
Synonyms:(E)-5-Styrylisatin | CHEMBL466872
TypeSmall organic molecule
Emp. Form.C16H11NO2
Mol. Mass.249.264
SMILESO=C1Nc2ccc(\C=C\c3ccccc3)cc2C1=O