Reaction Details
TargetFree fatty acid receptor 1
LigandBDBM50277776
Substrate/Competitorn/a
Meas. Tech.ChEMBL_501421 (CHEMBL994680)
IC50 3±n/a nM
Citation Humphries, PSBenbow, JWBonin, PDBoyer, DDoran, SDFrisbie, RKPiotrowski, DWBalan, GBechle, BMConn, ELDirico, KJOliver, RMSoeller, WCSouthers, JAYang, X Synthesis and SAR of 1,2,3,4-tetrahydroisoquinolin-1-ones as novel G-protein-coupled receptor 40 (GPR40) antagonists. Bioorg Med Chem Lett19:2400-3 (2009) 
 
Free fatty acid receptor 1
Name:Free fatty acid receptor 1
Type:G Protein-Coupled Receptor (GPCR)
Mol. Mass.:31473.32
Organism:Homo sapiens (Human)
Description:O14842
Residue:300
BDBM50277776
NameBDBM50277776
Synonyms:(3R,4R)-3-(4-(3,4-dimethylphenoxy)phenyl)-1-oxo-2-propyl-1,2,3,4-tetrahydroisoquinoline-4-carboxylic acid | CHEMBL485007
TypeSmall organic molecule
Emp. Form.C27H27NO4
Mol. Mass.429.5076
SMILESCCCN1[C@H]([C@H](C(O)=O)c2ccccc2C1=O)c1ccc(Oc2ccc(C)c(C)c2)cc1