Reaction Details
TargetFree fatty acid receptor 1
LigandBDBM50277887
Substrate/Competitorn/a
Meas. Tech.ChEMBL_501421 (CHEMBL994680)
IC50 10±n/a nM
Citation Humphries, PSBenbow, JWBonin, PDBoyer, DDoran, SDFrisbie, RKPiotrowski, DWBalan, GBechle, BMConn, ELDirico, KJOliver, RMSoeller, WCSouthers, JAYang, X Synthesis and SAR of 1,2,3,4-tetrahydroisoquinolin-1-ones as novel G-protein-coupled receptor 40 (GPR40) antagonists. Bioorg Med Chem Lett19:2400-3 (2009) 
 
Free fatty acid receptor 1
Name:Free fatty acid receptor 1
Type:G Protein-Coupled Receptor (GPCR)
Mol. Mass.:31473.32
Organism:Homo sapiens (Human)
Description:O14842
Residue:300
BDBM50277887
NameBDBM50277887
Synonyms:(3R,4R)-3-(benzo[d]thiazol-2-yl)-2-(2-ethylbutyl)-1-oxo-1,2,3,4-tetrahydroisoquinoline-4-carboxylic acid | CHEMBL485131
TypeSmall organic molecule
Emp. Form.C23H24N2O3S
Mol. Mass.408.513
SMILESCCC(CC)CN1[C@H]([C@H](C(O)=O)c2ccccc2C1=O)c1nc2ccccc2s1