Reaction Details
TargetProteasome subunit beta type-8
LigandBDBM50277889
Substrate/Competitorn/a
Meas. Tech.ChEMBL_502029 (CHEMBL981240)
IC50 14±n/a nM
Citation Zhou, HJAujay, MABennett, MKDajee, MDemo, SDFang, YHo, MNJiang, JKirk, CJLaidig, GJLewis, ERLu, YMuchamuel, TParlati, FRing, EShenk, KDShields, JShwonek, PJStanton, TSun, CMSylvain, CWoo, TMYang, J Design and synthesis of an orally bioavailable and selective peptide epoxyketone proteasome inhibitor (PR-047). J Med Chem52:3028-38 (2009) 
 
Proteasome subunit beta type-8
Name:Proteasome subunit beta type-8
Type:PROTEIN
Mol. Mass.:30357.49
Organism:Homo sapiens (Human)
Description:ChEMBL_1446797
Residue:276
BDBM50277889
NameBDBM50277889
Synonyms:CARFILZOMIB | CHEMBL451887
TypeSmall organic molecule
Emp. Form.C40H57N5O7
Mol. Mass.719.9099
SMILESCC(C)C[C@H](NC(=O)[C@H](CCc1ccccc1)NC(=O)CN1CCOCC1)C(=O)N[C@@H](Cc1ccccc1)C(=O)N[C@@H](CC(C)C)C(=O)[C@@]1(C)CO1