Reaction Details
TargetPeroxisome proliferator-activated receptor gamma
LigandBDBM50277821
Substrate/Competitorn/a
Meas. Tech.ChEMBL_502070 (CHEMBL983195)
IC50 2±n/a nM
Citation Bénardeau, ABenz, JBinggeli, ABlum, DBoehringer, MGrether, UHilpert, HKuhn, BMärki, HPMeyer, MPüntener, KRaab, SRuf, ASchlatter, DMohr, P Aleglitazar, a new, potent, and balanced dual PPARalpha/gamma agonist for the treatment of type II diabetes. Bioorg Med Chem Lett19:2468-73 (2009) 
 
Peroxisome proliferator-activated receptor gamma
Name:Peroxisome proliferator-activated receptor gamma
Type:Nuclear Receptor
Mol. Mass.:57613.46
Organism:Homo sapiens (Human)
Description:P37231
Residue:505
BDBM50277821
NameBDBM50277821
Synonyms:2-(hexyloxy)-3-(4-(2-(5-methyl-2-phenyloxazol-4-yl)ethoxy)benzo[b]thiophen-7-yl)propanoic acid | CHEMBL482740
TypeSmall organic molecule
Emp. Form.C29H33NO5S
Mol. Mass.507.641
SMILESCCCCCCOC(Cc1ccc(OCCc2nc(oc2C)-c2ccccc2)c2ccsc12)C(O)=O