Reaction Details
TargetPeroxisome proliferator-activated receptor gamma
LigandBDBM50277859
Substrate/Competitorn/a
Meas. Tech.ChEMBL_502070 (CHEMBL983195)
IC50 113±n/a nM
Citation Bénardeau, ABenz, JBinggeli, ABlum, DBoehringer, MGrether, UHilpert, HKuhn, BMärki, HPMeyer, MPüntener, KRaab, SRuf, ASchlatter, DMohr, P Aleglitazar, a new, potent, and balanced dual PPARalpha/gamma agonist for the treatment of type II diabetes. Bioorg Med Chem Lett19:2468-73 (2009) 
 
Peroxisome proliferator-activated receptor gamma
Name:Peroxisome proliferator-activated receptor gamma
Type:Nuclear Receptor
Mol. Mass.:57613.46
Organism:Homo sapiens (Human)
Description:P37231
Residue:505
BDBM50277859
NameBDBM50277859
Synonyms:2-methoxy-3-(4-(2-(5-methyl-2-phenyloxazol-4-yl)ethoxy)naphthalen-1-yl)propanoic acid | CHEMBL521131
TypeSmall organic molecule
Emp. Form.C26H25NO5
Mol. Mass.431.4804
SMILESCOC(Cc1ccc(OCCc2nc(oc2C)-c2ccccc2)c2ccccc12)C(O)=O