Reaction Details
TargetPeroxisome proliferator-activated receptor alpha
LigandBDBM50277897
Substrate/Competitorn/a
Meas. Tech.ChEMBL_502069 (CHEMBL983194)
IC50 38±n/a nM
Citation Bénardeau, ABenz, JBinggeli, ABlum, DBoehringer, MGrether, UHilpert, HKuhn, BMärki, HPMeyer, MPüntener, KRaab, SRuf, ASchlatter, DMohr, P Aleglitazar, a new, potent, and balanced dual PPARalpha/gamma agonist for the treatment of type II diabetes. Bioorg Med Chem Lett19:2468-73 (2009) 
 
Peroxisome proliferator-activated receptor alpha
Name:Peroxisome proliferator-activated receptor alpha
Type:Enzyme
Mol. Mass.:52222.08
Organism:Homo sapiens (Human)
Description:Q07869
Residue:468
BDBM50277897
NameBDBM50277897
Synonyms:(2S)-2-methoxy-3-{4-[2-(5-methyl-2-phenyl-1,3-oxazol-4-yl)ethoxy]-1-benzothiophen-7-yl}propanoic acid CHEMBL519504
TypeSmall organic molecule
Emp. Form.C24H23NO5S
Mol. Mass.437.508
SMILESCO[C@@H](Cc1ccc(OCCc2nc(oc2C)-c2ccccc2)c2ccsc12)C(O)=O