Reaction Details
TargetPeroxisome proliferator-activated receptor gamma
LigandBDBM50277899
Substrate/Competitorn/a
Meas. Tech.ChEMBL_502070 (CHEMBL983195)
IC50 8±n/a nM
Citation Bénardeau, ABenz, JBinggeli, ABlum, DBoehringer, MGrether, UHilpert, HKuhn, BMärki, HPMeyer, MPüntener, KRaab, SRuf, ASchlatter, DMohr, P Aleglitazar, a new, potent, and balanced dual PPARalpha/gamma agonist for the treatment of type II diabetes. Bioorg Med Chem Lett19:2468-73 (2009) 
 
Peroxisome proliferator-activated receptor gamma
Name:Peroxisome proliferator-activated receptor gamma
Type:Nuclear Receptor
Mol. Mass.:57613.46
Organism:Homo sapiens (Human)
Description:P37231
Residue:505
BDBM50277899
NameBDBM50277899
Synonyms:(S)-3-(4-(2-(2-(3,5-dimethylphenyl)-5-methyloxazol-4-yl)ethoxy)benzo[b]thiophen-7-yl)-2-methoxypropanoic acid | CHEMBL484138
TypeSmall organic molecule
Emp. Form.C26H27NO5S
Mol. Mass.465.561
SMILESCO[C@@H](Cc1ccc(OCCc2nc(oc2C)-c2cc(C)cc(C)c2)c2ccsc12)C(O)=O