Reaction Details
TargetPeroxisome proliferator-activated receptor gamma
LigandBDBM50277974
Substrate/Competitorn/a
Meas. Tech.ChEMBL_502070 (CHEMBL983195)
IC50 2±n/a nM
Citation Bénardeau, ABenz, JBinggeli, ABlum, DBoehringer, MGrether, UHilpert, HKuhn, BMärki, HPMeyer, MPüntener, KRaab, SRuf, ASchlatter, DMohr, P Aleglitazar, a new, potent, and balanced dual PPARalpha/gamma agonist for the treatment of type II diabetes. Bioorg Med Chem Lett19:2468-73 (2009) 
 
Peroxisome proliferator-activated receptor gamma
Name:Peroxisome proliferator-activated receptor gamma
Type:Nuclear Receptor
Mol. Mass.:57613.46
Organism:Homo sapiens (Human)
Description:P37231
Residue:505
BDBM50277974
NameBDBM50277974
Synonyms:(S)-2-(cyclopropylmethoxy)-3-(4-(2-(5-methyl-2-phenyloxazol-4-yl)ethoxy)benzo[b]thiophen-7-yl)propanoic acid | CHEMBL484001
TypeSmall organic molecule
Emp. Form.C27H27NO5S
Mol. Mass.477.572
SMILESCc1oc(nc1CCOc1ccc(C[C@H](OCC2CC2)C(O)=O)c2sccc12)-c1ccccc1