Reaction Details
TargetPeroxisome proliferator-activated receptor gamma
LigandBDBM50278067
Substrate/Competitorn/a
Meas. Tech.ChEMBL_502070 (CHEMBL983195)
IC50 11±n/a nM
Citation Bénardeau, ABenz, JBinggeli, ABlum, DBoehringer, MGrether, UHilpert, HKuhn, BMärki, HPMeyer, MPüntener, KRaab, SRuf, ASchlatter, DMohr, P Aleglitazar, a new, potent, and balanced dual PPARalpha/gamma agonist for the treatment of type II diabetes. Bioorg Med Chem Lett19:2468-73 (2009) 
 
Peroxisome proliferator-activated receptor gamma
Name:Peroxisome proliferator-activated receptor gamma
Type:Nuclear Receptor
Mol. Mass.:57613.46
Organism:Homo sapiens (Human)
Description:P37231
Residue:505
BDBM50278067
NameBDBM50278067
Synonyms:(S)-2-methoxy-3-(7-(2-(5-methyl-2-phenyloxazol-4-yl)ethoxy)benzo[b]thiophen-4-yl)propanoic acid | CHEMBL484330
TypeSmall organic molecule
Emp. Form.C24H23NO5S
Mol. Mass.437.508
SMILESCO[C@@H](Cc1ccc(OCCc2nc(oc2C)-c2ccccc2)c2sccc12)C(O)=O