Reaction Details
TargetPeroxisome proliferator-activated receptor alpha
LigandBDBM50277900
Substrate/Competitorn/a
Meas. Tech.ChEMBL_502071 (CHEMBL983196)
EC50 20±n/a nM
Citation Bénardeau, ABenz, JBinggeli, ABlum, DBoehringer, MGrether, UHilpert, HKuhn, BMärki, HPMeyer, MPüntener, KRaab, SRuf, ASchlatter, DMohr, P Aleglitazar, a new, potent, and balanced dual PPARalpha/gamma agonist for the treatment of type II diabetes. Bioorg Med Chem Lett19:2468-73 (2009) 
 
Peroxisome proliferator-activated receptor alpha
Name:Peroxisome proliferator-activated receptor alpha
Type:Enzyme
Mol. Mass.:52222.08
Organism:Homo sapiens (Human)
Description:Q07869
Residue:468
BDBM50277900
NameBDBM50277900
Synonyms:(S)-3-(4-(2-(2-(4-isopropylphenyl)-5-methyloxazol-4-yl)ethoxy)benzo[b]thiophen-7-yl)-2-methoxypropanoic acid | CHEMBL484409
TypeSmall organic molecule
Emp. Form.C27H29NO5S
Mol. Mass.479.588
SMILESCO[C@@H](Cc1ccc(OCCc2nc(oc2C)-c2ccc(cc2)C(C)C)c2ccsc12)C(O)=O