Reaction Details
TargetPeroxisome proliferator-activated receptor alpha
LigandBDBM50277976
Substrate/Competitorn/a
Meas. Tech.ChEMBL_502071 (CHEMBL983196)
EC50 16±n/a nM
Citation Bénardeau, ABenz, JBinggeli, ABlum, DBoehringer, MGrether, UHilpert, HKuhn, BMärki, HPMeyer, MPüntener, KRaab, SRuf, ASchlatter, DMohr, P Aleglitazar, a new, potent, and balanced dual PPARalpha/gamma agonist for the treatment of type II diabetes. Bioorg Med Chem Lett19:2468-73 (2009) 
 
Peroxisome proliferator-activated receptor alpha
Name:Peroxisome proliferator-activated receptor alpha
Type:Enzyme
Mol. Mass.:52222.08
Organism:Homo sapiens (Human)
Description:Q07869
Residue:468
BDBM50277976
NameBDBM50277976
Synonyms:(S)-2-(cyclopropylmethoxy)-3-(4-(2-(2-(4-isopropylphenyl)-5-methyloxazol-4-yl)ethoxy)benzo[b]thiophen-7-yl)propanoic acid | CHEMBL485188
TypeSmall organic molecule
Emp. Form.C30H33NO5S
Mol. Mass.519.652
SMILESCC(C)c1ccc(cc1)-c1nc(CCOc2ccc(C[C@H](OCC3CC3)C(O)=O)c3sccc23)c(C)o1