Reaction Details
TargetNeuromedin-K receptor
LigandBDBM50277511
Substrate/Competitorn/a
Meas. Tech.ChEMBL_501454 (CHEMBL994714)
Ki 2.4±n/a nM
Citation Jiang, JBunda, JLDoss, GAChicchi, GGKurtz, MMTsao, KLTong, XZheng, SUpthagrove, ASamuel, KTschirret-Guth, RKumar, SWheeldon, ACarlson, EJHargreaves, RBurns, DHamill, TRyan, CKrause, SMEng, WDeVita, RJMills, SG Potent, brain-penetrant, hydroisoindoline-based human neurokinin-1 receptor antagonists. J Med Chem52:3039-46 (2009) 
 
Neuromedin-K receptor
Name:Neuromedin-K receptor
Type:Enzyme
Mol. Mass.:52221.96
Organism:Homo sapiens (Human)
Description:P29371
Residue:465
BDBM50277511
NameBDBM50277511
Synonyms:3-[(3aR,4R,5S,7aS)-5-{(1R)-1-[3,5-Bis(trifluoromethyl)phenyl]ethoxy}-4-(4-fluorophenyl)octahydro-1H-isoindol-2-yl]cyclopent-2-en-1-one | CHEMBL447955
TypeSmall organic molecule
Emp. Form.C29H28F7NO2
Mol. Mass.555.5269
SMILESC[C@@H](O[C@H]1CC[C@@H]2CN(C[C@H]2[C@@H]1c1ccc(F)cc1)C1=CC(=O)CC1)c1cc(cc(c1)C(F)(F)F)C(F)(F)F