Reaction Details
TargetProtein mono-ADP-ribosyltransferase PARP3 [R100H]
LigandBDBM50226518
Substrate/Competitorn/a
Meas. Tech.ChEMBL_501487 (CHEMBL984126)
Kd>2000±n/a nM
Citation Lehtiö, LJemth, ASCollins, RLoseva, OJohansson, AMarkova, NHammarström, MFlores, AHolmberg-Schiavone, LWeigelt, JHelleday, TSchüler, HKarlberg, T Structural basis for inhibitor specificity in human poly(ADP-ribose) polymerase-3. J Med Chem52:3108-11 (2009) 
 
Protein mono-ADP-ribosyltransferase PARP3 [R100H]
Name:Protein mono-ADP-ribosyltransferase PARP3 [R100H]
Type:PROTEIN
Mol. Mass.:60071.85
Organism:Homo sapiens (Human)
Description:Q9Y6F1[R100H]
Residue:533
BDBM50226518
NameBDBM50226518
Synonyms:3-Aminobenzoesaeure CHEMBL307782 | m-Aminobenzoesaeure
TypeSmall organic molecule
Emp. Form.C7H7NO2
Mol. Mass.137.136
SMILESNc1cccc(c1)C(O)=O