Reaction Details
TargetProtein mono-ADP-ribosyltransferase PARP3 [R100H]
LigandBDBM27497
Substrate/Competitorn/a
Meas. Tech.ChEMBL_501487 (CHEMBL984126)
Kd 700±n/a nM
Citation Lehtiö, LJemth, ASCollins, RLoseva, OJohansson, AMarkova, NHammarström, MFlores, AHolmberg-Schiavone, LWeigelt, JHelleday, TSchüler, HKarlberg, T Structural basis for inhibitor specificity in human poly(ADP-ribose) polymerase-3. J Med Chem52:3108-11 (2009) 
 
Protein mono-ADP-ribosyltransferase PARP3 [R100H]
Name:Protein mono-ADP-ribosyltransferase PARP3 [R100H]
Type:PROTEIN
Mol. Mass.:60071.85
Organism:Homo sapiens (Human)
Description:Q9Y6F1[R100H]
Residue:533
BDBM27497
NameBDBM27497
Synonyms:2-(dimethylamino)-N-(6-oxo-5,6-dihydrophenanthridin-2-yl)acetamide CHEMBL372303 N~2~,N~2~-DIMETHYL-N~1~-(6-OXO-5,6-DIHYDROPHENANTHRIDIN-2-YL)GLYCINAMIDE | PJ34
TypeSmall organic molecule
Emp. Form.C17H17N3O2
Mol. Mass.295.3358
SMILESCN(C)CC(=O)Nc1ccc2[nH]c(=O)c3ccccc3c2c1