Reaction Details
TargetPoly [ADP-ribose] polymerase 1
LigandBDBM27497
Substrate/Competitorn/a
Meas. Tech.ChEMBL_501488 (CHEMBL984127)
Kd 110±n/a nM
Citation Lehtiö, LJemth, ASCollins, RLoseva, OJohansson, AMarkova, NHammarström, MFlores, AHolmberg-Schiavone, LWeigelt, JHelleday, TSchüler, HKarlberg, T Structural basis for inhibitor specificity in human poly(ADP-ribose) polymerase-3. J Med Chem52:3108-11 (2009) 
 
Poly [ADP-ribose] polymerase 1
Name:Poly [ADP-ribose] polymerase 1
Type:n/a
Mol. Mass.:113114.22
Organism:Homo sapiens (Human)
Description:P09874
Residue:1014
BDBM27497
NameBDBM27497
Synonyms:2-(dimethylamino)-N-(6-oxo-5,6-dihydrophenanthridin-2-yl)acetamide CHEMBL372303 N~2~,N~2~-DIMETHYL-N~1~-(6-OXO-5,6-DIHYDROPHENANTHRIDIN-2-YL)GLYCINAMIDE | PJ34
TypeSmall organic molecule
Emp. Form.C17H17N3O2
Mol. Mass.295.3358
SMILESCN(C)CC(=O)Nc1ccc2[nH]c(=O)c3ccccc3c2c1