Reaction Details
TargetPoly [ADP-ribose] polymerase 1
LigandBDBM27533
Substrate/Competitorn/a
Meas. Tech.ChEMBL_501488 (CHEMBL984127)
Kd 19±n/a nM
Citation Lehtiö, LJemth, ASCollins, RLoseva, OJohansson, AMarkova, NHammarström, MFlores, AHolmberg-Schiavone, LWeigelt, JHelleday, TSchüler, HKarlberg, T Structural basis for inhibitor specificity in human poly(ADP-ribose) polymerase-3. J Med Chem52:3108-11 (2009) 
 
Poly [ADP-ribose] polymerase 1
Name:Poly [ADP-ribose] polymerase 1
Type:n/a
Mol. Mass.:113114.22
Organism:Homo sapiens (Human)
Description:P09874
Residue:1014
BDBM27533
NameBDBM27533
Synonyms:4-(3-(1,4-diazepane-1-carbonyl)-4-fluorobenzyl)phthalazin-1(2H)-one 4-[[3-(1,4-Diazepane-1-carbonyl)-4-fluorophenyl]methyl]-2Hphthalazin-1-one CHEMBL380648 KU-0058948
TypeSmall organic molecule
Emp. Form.C21H21FN4O2
Mol. Mass.380.4154
SMILESFc1ccc(Cc2n[nH]c(=O)c3ccccc23)cc1C(=O)N1CCCNCC1