Reaction Details
TargetCarbonic anhydrase 1
LigandBDBM50259471
Substrate/Competitorn/a
Meas. Tech.ChEMBL_498933 (CHEMBL976240)
Ki 523±n/a nM
Citation Kasimoğullari, RBülbül, MGünhan, HGüleryüz, H Effects of new 5-amino-1,3,4-thiadiazole-2-sulfonamide derivatives on human carbonic anhydrase isozymes. Bioorg Med Chem17:3295-301 (2009) 
 
Carbonic anhydrase 1
Name:Carbonic anhydrase 1
Type:Enzyme
Mol. Mass.:28873.37
Organism:Homo sapiens (Human)
Description:P00915
Residue:261
BDBM50259471
NameBDBM50259471
Synonyms:4-Benzoyl-1-(3-((4-hydroxyphenyl)diazenyl)phenyl)-5-phenyl-N-(5-sulfamoyl-1,3,4-thiadiazol-2-yl)-1H-pyrazole-3-carboxamide | CHEMBL510182
TypeSmall organic molecule
Emp. Form.C31H22N8O5S2
Mol. Mass.650.687
SMILESNS(=O)(=O)c1nnc(NC(=O)c2nn(c(c2C(=O)c2ccccc2)-c2ccccc2)-c2cccc(c2)N=Nc2ccc(O)cc2)s1