Reaction Details
TargetCarbonic anhydrase 2
LigandBDBM50259470
Substrate/Competitorn/a
Meas. Tech.ChEMBL_498929 (CHEMBL975370)
IC50 10±n/a nM
Citation Kasimoğullari, RBülbül, MGünhan, HGüleryüz, H Effects of new 5-amino-1,3,4-thiadiazole-2-sulfonamide derivatives on human carbonic anhydrase isozymes. Bioorg Med Chem17:3295-301 (2009) 
 
Carbonic anhydrase 2
Name:Carbonic anhydrase 2
Type:Enzyme
Mol. Mass.:29250.71
Organism:Homo sapiens (Human)
Description:P00918
Residue:260
BDBM50259470
NameBDBM50259470
Synonyms:4-Benzoyl-1-(3-hydroxyphenyl)-5-phenyl-N-(5-sulfamoyl-1,3,4-thiadiazol-2-yl)-1H-pyrazole-3-carboxamide | CHEMBL513659
TypeSmall organic molecule
Emp. Form.C25H18N6O5S2
Mol. Mass.546.578
SMILESNS(=O)(=O)c1nnc(NC(=O)c2nn(c(c2C(=O)c2ccccc2)-c2ccccc2)-c2cccc(O)c2)s1