Reaction Details
TargetCarbonic anhydrase 1
LigandBDBM50259375
Substrate/Competitorn/a
Meas. Tech.ChEMBL_498933 (CHEMBL976240)
Ki 1863±n/a nM
Citation Kasimoğullari, RBülbül, MGünhan, HGüleryüz, H Effects of new 5-amino-1,3,4-thiadiazole-2-sulfonamide derivatives on human carbonic anhydrase isozymes. Bioorg Med Chem17:3295-301 (2009) 
 
Carbonic anhydrase 1
Name:Carbonic anhydrase 1
Type:Enzyme
Mol. Mass.:28873.37
Organism:Homo sapiens (Human)
Description:P00915
Residue:261
BDBM50259375
NameBDBM50259375
Synonyms:4-Benzoyl-1-(3-iodophenyl)-5-phenyl-N-(5-sulfamoyl-1,3,4-thiadiazol-2-yl)-1H-pyrazole-3-carboxamide | CHEMBL513820
TypeSmall organic molecule
Emp. Form.C25H17IN6O4S2
Mol. Mass.656.475
SMILESNS(=O)(=O)c1nnc(NC(=O)c2nn(c(c2C(=O)c2ccccc2)-c2ccccc2)-c2cccc(I)c2)s1