Reaction Details
TargetCarbonic anhydrase 2
LigandBDBM50259373
Substrate/Competitorn/a
Meas. Tech.ChEMBL_498929 (CHEMBL975370)
IC50 410±n/a nM
Citation Kasimoğullari, RBülbül, MGünhan, HGüleryüz, H Effects of new 5-amino-1,3,4-thiadiazole-2-sulfonamide derivatives on human carbonic anhydrase isozymes. Bioorg Med Chem17:3295-301 (2009) 
 
Carbonic anhydrase 2
Name:Carbonic anhydrase 2
Type:Enzyme
Mol. Mass.:29250.71
Organism:Homo sapiens (Human)
Description:P00918
Residue:260
BDBM50259373
NameBDBM50259373
Synonyms:CHEMBL507085 | tert-Butyl2-((3-(4-benzoyl-5-phenyl-3-(5-sulfamoyl-1,3,4-thiadiazol-2-ylcarbamoyl)-1H-pyrazol-1-yl)phenyl)diazenyl)-3-oxobutanoate
TypeSmall organic molecule
Emp. Form.C33H30N8O7S2
Mol. Mass.714.771
SMILESCC(=O)C(=NNc1cccc(c1)-n1nc(C(=O)Nc2nnc(s2)S(N)(=O)=O)c(C(=O)c2ccccc2)c1-c1ccccc1)C(=O)OC(C)(C)C