Reaction Details
TargetCarbonic anhydrase 1
LigandBDBM50259372
Substrate/Competitorn/a
Meas. Tech.ChEMBL_498930 (CHEMBL975371)
IC50 80±n/a nM
Citation Kasimoğullari, RBülbül, MGünhan, HGüleryüz, H Effects of new 5-amino-1,3,4-thiadiazole-2-sulfonamide derivatives on human carbonic anhydrase isozymes. Bioorg Med Chem17:3295-301 (2009) 
 
Carbonic anhydrase 1
Name:Carbonic anhydrase 1
Type:Enzyme
Mol. Mass.:28873.37
Organism:Homo sapiens (Human)
Description:P00915
Residue:261
BDBM50259372
NameBDBM50259372
Synonyms:4-Benzoyl-1-(3-((1,3-dioxo-1,3-diphenylpropan-2-yl)diazenyl)phenyl)-5-phenyl-N-(5-sulfamoyl-1,3,4-thiadiazol-2-yl)-1H-pyrazole-3-carboxamide | CHEMBL503194
TypeSmall organic molecule
Emp. Form.C40H28N8O6S2
Mol. Mass.780.83
SMILES[#7]S(=O)(=O)c1nnc(-[#7]-[#6](=O)-c2nn(c(c2-[#6](=O)-c2ccccc2)-c2ccccc2)-c2cccc(-[#7]\[#7]=[#6](\[#6](=O)-c3ccccc3)-[#6](=O)-c3ccccc3)c2)s1