Reaction Details
TargetCarbonic anhydrase 1
LigandBDBM50259371
Substrate/Competitorn/a
Meas. Tech.ChEMBL_498933 (CHEMBL976240)
Ki 81±n/a nM
Citation Kasimoğullari, RBülbül, MGünhan, HGüleryüz, H Effects of new 5-amino-1,3,4-thiadiazole-2-sulfonamide derivatives on human carbonic anhydrase isozymes. Bioorg Med Chem17:3295-301 (2009) 
 
Carbonic anhydrase 1
Name:Carbonic anhydrase 1
Type:Enzyme
Mol. Mass.:28873.37
Organism:Homo sapiens (Human)
Description:P00915
Residue:261
BDBM50259371
NameBDBM50259371
Synonyms:CHEMBL445982 | Ethyl-2-((3-(4-benzoyl-5-phenyl-3-(5-sulfamoyl-1,3,4-thiadiazol-2-ylcarbamoyl)-1H-pyrazol-1-yl)phenyl)diazenyl)-3-oxo-3-phenylpropanoate
TypeSmall organic molecule
Emp. Form.C36H28N8O7S2
Mol. Mass.748.787
SMILESCCOC(=O)C(=NNc1cccc(c1)-n1nc(C(=O)Nc2nnc(s2)S(N)(=O)=O)c(C(=O)c2ccccc2)c1-c1ccccc1)C(=O)c1ccccc1