Reaction Details
TargetXanthine dehydrogenase/oxidase
LigandBDBM50259596
Substrate/Competitorn/a
Meas. Tech.ChEMBL_499127 (CHEMBL1011401)
IC50 16000±n/a nM
Citation Gong, JHuang, KWang, FYang, LFeng, YLi, HLi, XZeng, SWu, XStöckigt, JZhao, YQu, J Preparation of two sets of 5,6,7-trioxygenated dihydroflavonol derivatives as free radical scavengers and neuronal cell protectors to oxidative damage. Bioorg Med Chem17:3414-25 (2009) 
 
Xanthine dehydrogenase/oxidase
Name:Xanthine dehydrogenase/oxidase
Type:Enzyme
Mol. Mass.:146441.21
Organism:Homo sapiens (Human)
Description:P47989
Residue:1333
BDBM50259596
NameBDBM50259596
Synonyms:(+/-)-cis-2,3-Dihydro-3,6-dihydroxy-5,7-dimethoxy-2-(3,4-dimethoxyphenyl)-4H-1-benzopyran-4-one | CHEMBL468318
TypeSmall organic molecule
Emp. Form.C19H20O8
Mol. Mass.376.3573
SMILESCOc1ccc(cc1OC)[C@@H]1Oc2cc(OC)c(O)c(OC)c2C(=O)[C@@H]1O