Reaction Details
TargetProto-oncogene tyrosine-protein kinase Src
LigandBDBM50259601
Substrate/Competitorn/a
Meas. Tech.ChEMBL_499164 (CHEMBL1011438)
IC50>50000±n/a nM
Citation Lovering, FKirincich, SWang, WCombs, KResnick, LSabalski, JEButera, JLiu, JParris, KTelliez, JB Identification and SAR of squarate inhibitors of mitogen activated protein kinase-activated protein kinase 2 (MK-2). Bioorg Med Chem17:3342-51 (2009) 
 
Proto-oncogene tyrosine-protein kinase Src
Name:Proto-oncogene tyrosine-protein kinase Src
Type:Protein
Mol. Mass.:59838.60
Organism:Homo sapiens (Human)
Description:P12931
Residue:536
BDBM50259601
NameBDBM50259601
Synonyms:3-{[2-(2-Fluorophenyl)pyridin-4-yl]amino}-4-{[(1R)-1-phenylethyl]amino}cyclobut-3-ene-1,2-dione | CHEMBL468125
TypeSmall organic molecule
Emp. Form.C23H18FN3O2
Mol. Mass.387.4063
SMILESC[C@@H](Nc1c(Nc2ccnc(c2)-c2ccccc2F)c(=O)c1=O)c1ccccc1