Reaction Details
TargetMitogen-activated protein kinase 1
LigandBDBM50259637
Substrate/Competitorn/a
Meas. Tech.ChEMBL_499155 (CHEMBL1011429)
IC50 35000±n/a nM
Citation Lovering, FKirincich, SWang, WCombs, KResnick, LSabalski, JEButera, JLiu, JParris, KTelliez, JB Identification and SAR of squarate inhibitors of mitogen activated protein kinase-activated protein kinase 2 (MK-2). Bioorg Med Chem17:3342-51 (2009) 
 
Mitogen-activated protein kinase 1
Name:Mitogen-activated protein kinase 1
Type:Ser/Thr Protein Kinase
Mol. Mass.:41392.76
Organism:Homo sapiens (Human)
Description:P28482
Residue:360
BDBM50259637
NameBDBM50259637
Synonyms:3-{[2-(2-Furyl)pyridin-4-yl]amino}-4-{[(1R)-1-phenylethyl]amino}cyclobut-3-ene-1,2-dione | CHEMBL519113
TypeSmall organic molecule
Emp. Form.C21H17N3O3
Mol. Mass.359.378
SMILESC[C@@H](Nc1c(Nc2ccnc(c2)-c2ccco2)c(=O)c1=O)c1ccccc1