Reaction Details
TargetMAP kinase-activated protein kinase 2
LigandBDBM50259637
Substrate/Competitorn/a
Meas. Tech.ChEMBL_499146 (CHEMBL1011420)
IC50 5300±n/a nM
Citation Lovering, FKirincich, SWang, WCombs, KResnick, LSabalski, JEButera, JLiu, JParris, KTelliez, JB Identification and SAR of squarate inhibitors of mitogen activated protein kinase-activated protein kinase 2 (MK-2). Bioorg Med Chem17:3342-51 (2009) 
 
MAP kinase-activated protein kinase 2
Name:MAP kinase-activated protein kinase 2
Type:Serine/threonine-protein kinase
Mol. Mass.:45579.87
Organism:Homo sapiens (Human)
Description:P49137
Residue:400
BDBM50259637
NameBDBM50259637
Synonyms:3-{[2-(2-Furyl)pyridin-4-yl]amino}-4-{[(1R)-1-phenylethyl]amino}cyclobut-3-ene-1,2-dione | CHEMBL519113
TypeSmall organic molecule
Emp. Form.C21H17N3O3
Mol. Mass.359.378
SMILESC[C@@H](Nc1c(Nc2ccnc(c2)-c2ccco2)c(=O)c1=O)c1ccccc1