Reaction Details
TargetMAP kinase-activated protein kinase 2
LigandBDBM50258907
Substrate/Competitorn/a
Meas. Tech.ChEMBL_499146 (CHEMBL1011420)
IC50 670±n/a nM
Citation Lovering, FKirincich, SWang, WCombs, KResnick, LSabalski, JEButera, JLiu, JParris, KTelliez, JB Identification and SAR of squarate inhibitors of mitogen activated protein kinase-activated protein kinase 2 (MK-2). Bioorg Med Chem17:3342-51 (2009) 
 
MAP kinase-activated protein kinase 2
Name:MAP kinase-activated protein kinase 2
Type:Serine/threonine-protein kinase
Mol. Mass.:45579.87
Organism:Homo sapiens (Human)
Description:P49137
Residue:400
BDBM50258907
NameBDBM50258907
Synonyms:3-{[(1R)-1-Phenylethyl]amino}-4-{[2-(pyrimidin-4-ylamino)pyridin-4-yl]amino}cyclobut-3-ene-1,2-dione | CHEMBL469124
TypeSmall organic molecule
Emp. Form.C21H18N6O2
Mol. Mass.386.4066
SMILESC[C@@H](Nc1c(Nc2ccnc(Nc3ccncn3)c2)c(=O)c1=O)c1ccccc1