Reaction Details
TargetBeta-3 adrenergic receptor
LigandBDBM50277503
Substrate/Competitorn/a
Meas. Tech.ChEMBL_497812 (CHEMBL1007108)
EC50 0.830000±n/a nM
Citation Hattori, KToda, SImanishi, MItou, SNakajima, YWashizuka, KAraki, THamashima, HTomishima, YSakurai, MMatsui, SImamura, EUeshima, KYamamoto, TYamamoto, NIshikawa, HNakano, KUnami, NHamada, KMatsumura, YTakamura, F Discovery of highly potent and selective biphenylacylsulfonamide-based beta3-adrenergic receptor agonists and evaluation of physical properties as potential overactive bladder therapies: part 5. J Med Chem52:3063-72 (2009) 
 
Beta-3 adrenergic receptor
Name:Beta-3 adrenergic receptor
Type:PROTEIN
Mol. Mass.:43072.49
Organism:Canis familiaris
Description:ChEMBL_497812
Residue:405
BDBM50277503
NameBDBM50277503
Synonyms:3-(Cyclohexyloxy)-4'-(2-{[(2R)-2-hydroxy-2-phenylethyl]amino}-ethyl)-N-(methylsulfonyl)biphenyl-4-carboxamide hydrochloride | CHEMBL469395
TypeSmall organic molecule
Emp. Form.C30H36N2O5S
Mol. Mass.536.682
SMILESCS(=O)(=O)NC(=O)c1ccc(cc1OC1CCCCC1)-c1ccc(CCNC[C@H](O)c2ccccc2)cc1