Reaction Details
TargetBeta-3 adrenergic receptor
LigandBDBM50243064
Substrate/Competitorn/a
Meas. Tech.ChEMBL_497791 (CHEMBL1007087)
EC50 1.5±n/a nM
Citation Hattori, KToda, SImanishi, MItou, SNakajima, YWashizuka, KAraki, THamashima, HTomishima, YSakurai, MMatsui, SImamura, EUeshima, KYamamoto, TYamamoto, NIshikawa, HNakano, KUnami, NHamada, KMatsumura, YTakamura, F Discovery of highly potent and selective biphenylacylsulfonamide-based beta3-adrenergic receptor agonists and evaluation of physical properties as potential overactive bladder therapies: part 5. J Med Chem52:3063-72 (2009) 
 
Beta-3 adrenergic receptor
Name:Beta-3 adrenergic receptor
Type:G Protein-Coupled Receptor (GPCR)
Mol. Mass.:43534.88
Organism:Homo sapiens (Human)
Description:n/a
Residue:408
BDBM50243064
NameBDBM50243064
Synonyms:(R)-4'-(2-(2-hydroxy-2-(pyridin-3-yl)ethylamino)ethyl)-3-isopropoxybiphenyl-4-carboxylic acid CHEMBL470292
TypeSmall organic molecule
Emp. Form.C25H28N2O4
Mol. Mass.420.5008
SMILESCC(C)Oc1cc(ccc1C(O)=O)-c1ccc(CCNC[C@H](O)c2cccnc2)cc1