Reaction Details
TargetBeta-2 adrenergic receptor
LigandBDBM50236160
Substrate/Competitorn/a
Meas. Tech.ChEMBL_497790 (CHEMBL1007086)
EC50 586±n/a nM
Citation Hattori, KToda, SImanishi, MItou, SNakajima, YWashizuka, KAraki, THamashima, HTomishima, YSakurai, MMatsui, SImamura, EUeshima, KYamamoto, TYamamoto, NIshikawa, HNakano, KUnami, NHamada, KMatsumura, YTakamura, F Discovery of highly potent and selective biphenylacylsulfonamide-based beta3-adrenergic receptor agonists and evaluation of physical properties as potential overactive bladder therapies: part 5. J Med Chem52:3063-72 (2009) 
 
Beta-2 adrenergic receptor
Name:Beta-2 adrenergic receptor
Type:n/a
Mol. Mass.:46461.69
Organism:Homo sapiens (Human)
Description:P07550
Residue:413
BDBM50236160
NameBDBM50236160
Synonyms:(R)-4'-(2-(2-hydroxy-2-phenylethylamino)ethyl)-3-(isopropylamino)biphenyl-4-carboxylic acid CHEMBL270964
TypeSmall organic molecule
Emp. Form.C26H30N2O3
Mol. Mass.418.528
SMILESCC(C)Nc1cc(ccc1C(O)=O)-c1ccc(CCNC[C@H](O)c2ccccc2)cc1