Reaction Details
TargetBeta-2 adrenergic receptor
LigandBDBM50277534
Substrate/Competitorn/a
Meas. Tech.ChEMBL_497790 (CHEMBL1007086)
EC50>10000±n/a nM
Citation Hattori, KToda, SImanishi, MItou, SNakajima, YWashizuka, KAraki, THamashima, HTomishima, YSakurai, MMatsui, SImamura, EUeshima, KYamamoto, TYamamoto, NIshikawa, HNakano, KUnami, NHamada, KMatsumura, YTakamura, F Discovery of highly potent and selective biphenylacylsulfonamide-based beta3-adrenergic receptor agonists and evaluation of physical properties as potential overactive bladder therapies: part 5. J Med Chem52:3063-72 (2009) 
 
Beta-2 adrenergic receptor
Name:Beta-2 adrenergic receptor
Type:n/a
Mol. Mass.:46461.69
Organism:Homo sapiens (Human)
Description:P07550
Residue:413
BDBM50277534
NameBDBM50277534
Synonyms:3-(Cyclohexylamino)-4'-(2-{[(2R)-2-hydroxy-2-pyridin-3-ylethyl]amino}ethyl)-N-(methylsulfonyl)biphenyl-4-carboxamide Trihydrochloride | CHEMBL452696
TypeSmall organic molecule
Emp. Form.C29H36N4O4S
Mol. Mass.536.686
SMILESCS(=O)(=O)NC(=O)c1ccc(cc1NC1CCCCC1)-c1ccc(CCNC[C@H](O)c2cccnc2)cc1