Reaction Details
TargetBeta-3 adrenergic receptor
LigandBDBM50249662
Substrate/Competitorn/a
Meas. Tech.ChEMBL_497791 (CHEMBL1007087)
EC50 0.029000±n/a nM
Citation Hattori, KToda, SImanishi, MItou, SNakajima, YWashizuka, KAraki, THamashima, HTomishima, YSakurai, MMatsui, SImamura, EUeshima, KYamamoto, TYamamoto, NIshikawa, HNakano, KUnami, NHamada, KMatsumura, YTakamura, F Discovery of highly potent and selective biphenylacylsulfonamide-based beta3-adrenergic receptor agonists and evaluation of physical properties as potential overactive bladder therapies: part 5. J Med Chem52:3063-72 (2009) 
 
Beta-3 adrenergic receptor
Name:Beta-3 adrenergic receptor
Type:G Protein-Coupled Receptor (GPCR)
Mol. Mass.:43534.88
Organism:Homo sapiens (Human)
Description:n/a
Residue:408
BDBM50249662
NameBDBM50249662
Synonyms:4'-(2-{[(2R)-2-(6-Aminopyridin-3-yl)-2-hydroxyethyl]amino}ethyl)-3-(cyclohexyloxy)-N-(methylsulfonyl)biphenyl-4-carboxamide Dihydrochloride | CHEMBL446806
TypeSmall organic molecule
Emp. Form.C29H36N4O5S
Mol. Mass.552.685
SMILESCS(=O)(=O)NC(=O)c1ccc(cc1OC1CCCCC1)-c1ccc(CCNC[C@H](O)c2cnccc2N)cc1