Reaction Details
TargetBeta-1 adrenergic receptor
LigandBDBM25392
Substrate/Competitorn/a
Meas. Tech.ChEMBL_497789 (CHEMBL1007085)
EC50 0.840000±n/a nM
Citation Hattori, KToda, SImanishi, MItou, SNakajima, YWashizuka, KAraki, THamashima, HTomishima, YSakurai, MMatsui, SImamura, EUeshima, KYamamoto, TYamamoto, NIshikawa, HNakano, KUnami, NHamada, KMatsumura, YTakamura, F Discovery of highly potent and selective biphenylacylsulfonamide-based beta3-adrenergic receptor agonists and evaluation of physical properties as potential overactive bladder therapies: part 5. J Med Chem52:3063-72 (2009) 
 
Beta-1 adrenergic receptor
Name:Beta-1 adrenergic receptor
Type:G Protein-Coupled Receptor (GPCR)
Mol. Mass.:51338.40
Organism:Homo sapiens (Human)
Description:P08588
Residue:477
BDBM25392
NameBDBM25392
Synonyms:4-[1-hydroxy-2-(isopropylamino)ethyl]pyrocatechol;hydrochloride 4-{1-hydroxy-2-[(propan-2-yl)amino]ethyl}benzene-1,2-diol, 2 ISOPROTERONOL Isoproterenol Isoproterenol,(+) Norisodrine | Novodrin
TypeSmall organic molecule
Emp. Form.C11H17NO3
Mol. Mass.211.2576
SMILESCC(C)NCC(O)c1ccc(O)c(O)c1