Reaction Details
TargetTrifunctional purine biosynthetic protein adenosine-3
LigandBDBM50249953
Substrate/Competitorn/a
Meas. Tech.ChEMBL_497843 (CHEMBL1003026)
IC50>20000±n/a nM
Citation Deng, YZhou, XKugel Desmoulin, SWu, JCherian, CHou, ZMatherly, LHGangjee, A Synthesis and biological activity of a novel series of 6-substituted thieno[2,3-d]pyrimidine antifolate inhibitors of purine biosynthesis with selectivity for high affinity folate receptors over the reduced folate carrier and proton-coupled folate transporter for cellular entry. J Med Chem52:2940-51 (2009) 
 
Trifunctional purine biosynthetic protein adenosine-3
Name:Trifunctional purine biosynthetic protein adenosine-3
Type:PROTEIN
Mol. Mass.:107504.27
Organism:Mus musculus
Description:ChEMBL_497843
Residue:1010
BDBM50249953
NameBDBM50249953
Synonyms:CHEMBL491129 | N-{4-[5-(2-Amino-4-oxo-3,4-dihydrothieno[2,3-d]pyrimidin-6-yl)-pentyl]benzoyl}-L-glutamic Acid
TypeSmall organic molecule
Emp. Form.C23H26N4O6S
Mol. Mass.486.541
SMILESNc1nc2sc(CCCCCc3ccc(cc3)C(=O)N[C@@H](CCC(O)=O)C(O)=O)cc2c(=O)[nH]1