Reaction Details
TargetProtein kinase C beta type
LigandBDBM50249959
Substrate/Competitorn/a
Meas. Tech.ChEMBL_498034 (CHEMBL1000237)
Ki 4.1±n/a nM
Citation Comin, MJCzifra, GKedei, NTelek, ALewin, NEKolusheva, SVelasquez, JFKobylarz, RJelinek, RBlumberg, PMMarquez, VE Conformationally constrained analogues of diacylglycerol (DAG). 31. Modulation of the biological properties of diacylgycerol lactones (DAG-lactones) containing rigid-rod acyl groups separated from the core lactone by spacer units of different lengths. J Med Chem52:3274-83 (2009) 
 
Protein kinase C beta type
Name:Protein kinase C beta type
Type:Enzyme
Mol. Mass.:76873.67
Organism:Homo sapiens (Human)
Description:The recombinant human PKC enzymes were produced using a baculovirus expression system in SF9 cells
Residue:671
BDBM50249959
NameBDBM50249959
Synonyms:CHEMBL522428 | [2-(Hydroxymethyl)-4-(methylethylidene)-5-oxo-2-2,3-dihydrofuryl]methyl 4-[2-(4-Methylphenyl)ethynyl]benzoate
TypeSmall organic molecule
Emp. Form.C25H24O5
Mol. Mass.404.4551
SMILES[#6]\[#6](-[#6])=[#6]-1/[#6]C([#6]-[#8])([#6]-[#8]-[#6](=O)-c2ccc(cc2)C#Cc2ccc(-[#6])cc2)[#8]-[#6]-1=O