Reaction Details
TargetAldo-keto reductase family 1 member C4
LigandBDBM50219490
Substrate/Competitorn/a
Meas. Tech.ChEMBL_498204 (CHEMBL980736)
Ki 18200±n/a nM
Citation El-Kabbani, OScammells, PJGosling, JDhagat, UEndo, SMatsunaga, TSoda, MHara, A Structure-guided design, synthesis, and evaluation of salicylic acid-based inhibitors targeting a selectivity pocket in the active site of human 20alpha-hydroxysteroid dehydrogenase (AKR1C1). J Med Chem52:3259-64 (2009) 
 
Aldo-keto reductase family 1 member C4
Name:Aldo-keto reductase family 1 member C4
Type:Enzyme
Mol. Mass.:37068.40
Organism:Homo sapiens (Human)
Description:P17516
Residue:323
BDBM50219490
NameBDBM50219490
Synonyms:3-Bromo-5-phenylsalicylc acid CHEMBL387536
TypeSmall organic molecule
Emp. Form.C13H9BrO3
Mol. Mass.293.113
SMILESOC(=O)c1cc(cc(Br)c1O)-c1ccccc1