Reaction Details
TargetAldo-keto reductase family 1 member C3
LigandBDBM50240769
Substrate/Competitorn/a
Meas. Tech.ChEMBL_498203 (CHEMBL980735)
Ki 21000±n/a nM
Citation El-Kabbani, OScammells, PJGosling, JDhagat, UEndo, SMatsunaga, TSoda, MHara, A Structure-guided design, synthesis, and evaluation of salicylic acid-based inhibitors targeting a selectivity pocket in the active site of human 20alpha-hydroxysteroid dehydrogenase (AKR1C1). J Med Chem52:3259-64 (2009) 
 
Aldo-keto reductase family 1 member C3
Name:Aldo-keto reductase family 1 member C3
Type:Enzyme
Mol. Mass.:36859.86
Organism:Homo sapiens (Human)
Description:P42330
Residue:323
BDBM50240769
NameBDBM50240769
Synonyms:3-Phenyl-5-bromosalicylic acid CHEMBL331146
TypeSmall organic molecule
Emp. Form.C13H9BrO3
Mol. Mass.293.113
SMILESOC(=O)c1cc(Br)cc(c1O)-c1ccccc1