Reaction Details
TargetAldo-keto reductase family 1 member C1
LigandBDBM50249792
Substrate/Competitorn/a
Meas. Tech.ChEMBL_498205 (CHEMBL980737)
IC50 2300±n/a nM
Citation El-Kabbani, OScammells, PJGosling, JDhagat, UEndo, SMatsunaga, TSoda, MHara, A Structure-guided design, synthesis, and evaluation of salicylic acid-based inhibitors targeting a selectivity pocket in the active site of human 20alpha-hydroxysteroid dehydrogenase (AKR1C1). J Med Chem52:3259-64 (2009) 
 
Aldo-keto reductase family 1 member C1
Name:Aldo-keto reductase family 1 member C1
Type:Enzyme
Mol. Mass.:36793.97
Organism:Homo sapiens (Human)
Description:Recombinant AKR1C1 enzyme was expressed in E. coli.
Residue:323
BDBM50249792
NameBDBM50249792
Synonyms:3,5-Dibromosalicylic acid | CHEMBL447448
TypeSmall organic molecule
Emp. Form.C7H4Br2O3
Mol. Mass.295.913
SMILESOC(=O)c1cc(Br)cc(Br)c1O