Reaction Details
TargetAldo-keto reductase family 1 member C1
LigandBDBM50249793
Substrate/Competitorn/a
Meas. Tech.ChEMBL_498205 (CHEMBL980737)
IC50 33±n/a nM
Citation El-Kabbani, OScammells, PJGosling, JDhagat, UEndo, SMatsunaga, TSoda, MHara, A Structure-guided design, synthesis, and evaluation of salicylic acid-based inhibitors targeting a selectivity pocket in the active site of human 20alpha-hydroxysteroid dehydrogenase (AKR1C1). J Med Chem52:3259-64 (2009) 
 
Aldo-keto reductase family 1 member C1
Name:Aldo-keto reductase family 1 member C1
Type:Enzyme
Mol. Mass.:36793.97
Organism:Homo sapiens (Human)
Description:Recombinant AKR1C1 enzyme was expressed in E. coli.
Residue:323
BDBM50249793
NameBDBM50249793
Synonyms:3',3'',5',5''-tetrabromophenolphthalein | CHEMBL521800
TypeSmall organic molecule
Emp. Form.C20H10Br4O4
Mol. Mass.633.907
SMILESOc1c(Br)cc(cc1Br)C1(OC(=O)c2ccccc12)c1cc(Br)c(O)c(Br)c1