Reaction Details
TargetAldo-keto reductase family 1 member C1
LigandBDBM50158460
Substrate/Competitorn/a
Meas. Tech.ChEMBL_498205 (CHEMBL980737)
IC50 48±n/a nM
Citation El-Kabbani, OScammells, PJGosling, JDhagat, UEndo, SMatsunaga, TSoda, MHara, A Structure-guided design, synthesis, and evaluation of salicylic acid-based inhibitors targeting a selectivity pocket in the active site of human 20alpha-hydroxysteroid dehydrogenase (AKR1C1). J Med Chem52:3259-64 (2009) 
 
Aldo-keto reductase family 1 member C1
Name:Aldo-keto reductase family 1 member C1
Type:Enzyme
Mol. Mass.:36793.97
Organism:Homo sapiens (Human)
Description:Recombinant AKR1C1 enzyme was expressed in E. coli.
Residue:323
BDBM50158460
NameBDBM50158460
Synonyms:(3,5-dibromo-4-hydroxyphenyl)(2-ethyl-1-benzofuran-3-yl)methanone 3,5-dibromo-4-hydroxyphenyl-2-ethyl-3-benzofuranyl ketone CHEMBL388590 US9856239, benzbromarone Uroleap (TN) | cid_2333
TypeSmall organic molecule
Emp. Form.C17H12Br2O3
Mol. Mass.424.083
SMILESCCc1oc2ccccc2c1C(=O)c1cc(Br)c(O)c(Br)c1