Reaction Details
TargetAdenosine receptor A2b
LigandBDBM50258620
Substrate/Competitorn/a
Meas. Tech.ChEMBL_499866 (CHEMBL976198)
Ki 2.8±n/a nM
Citation Fernández, FCaamaño, OIsabel Nieto, MLópez, CGarcía-Mera, XStefanachi, ANicolotti, OIsabel Loza, MBrea, JEsteve, CSegarra, VVidal, BCarotti, A 1,3-dialkyl-8-N-substituted benzyloxycarbonylamino-9-deazaxanthines as potent adenosine receptor ligands: Design, synthesis, structure-affinity and structure-selectivity relationships. Bioorg Med Chem17:3618-29 (2009) 
 
Adenosine receptor A2b
Name:Adenosine receptor A2b
Type:G Protein-Coupled Receptor (GPCR)
Mol. Mass.:36341.22
Organism:Homo sapiens (Human)
Description:n/a
Residue:332
BDBM50258620
NameBDBM50258620
Synonyms:CHEMBL512290 | [4-(2,3,4,5-Tetrahydro-1,3-dimethyl-2,4-dioxo-1H-pyrrolo[3,2-d]pyrimidin-6-yl)phenyl]methyl phenylcarbamate
TypeSmall organic molecule
Emp. Form.C22H20N4O4
Mol. Mass.404.4186
SMILESCn1c2cc([nH]c2c(=O)n(C)c1=O)-c1ccc(COC(=O)Nc2ccccc2)cc1